{"text_format":"1","workbook":"xlsx","n_sheets":4,"sheets":["Sheet3","RO Water Calculator","Sheet1","Sheet2"],"not_rendered":{"charts":0,"images":1,"macros":1,"external_links":0,"defined_names":1,"comments":1,"pivot_tables":0},"unopened":[],"bounds":{"document_bytes":16777216,"sheet_cells":100000,"rows_first":2000,"rows_last":500,"rows_between":2000,"halvings":0,"cell_chars":16384,"cell_head_chars":4096},"cells_cut":0,"cells_raw":0,"read":"whole","date_system":"1900"}

{"sheet":"Sheet3","index":0,"n_rows":86,"n_cols":10,"rows_kept":86,"cut":false,"hidden":true,"merged":[]}
["Enter Groen model number with drop down box - v look up","Hourly water usage","How many hours per day with drop down box","Temperature",null,"Fahrenheit","Temperature\nCorrection\n Factor",175,350,1500]
[null,null,null,null,null,null,null,"OP175","OP350","BWS1500"]
["SSB-3E",5.3,1,32,null,32,2.5295536755521004,69.182165095510172,138.36433019102034,592.98998653294439]
["SSB-5E",6.9,2,33,null,{"$f":"F3+1","v":33},2.4733582649681667,70.754003768334925,141.50800753666985,606.46288944287085]
["SSB-10EF",22,3,34,null,{"$f":"F4+1","v":34},2.418631511487106,72.354965677429917,144.70993135485983,620.18542009225644]
["(2)SSB-3EF",10.6,4,35,null,35,2.3653297541357068,73.985455809710189,147.97091161942038,634.16104979751594]
["(2)SSB-5EF",13.8,5,36,null,36,2.3134107776623911,75.645882559962175,151.29176511992435,648.39327908539008]
["(2)SSB-10EF",44,6,37,null,37,2.2628337599947863,77.336657731499997,154.67331546299999,662.88563769857137]
["SSB-3G",2.2000000000000002,7,38,null,38,2.2135592217703857,79.058196536542852,158.1163930730857,677.6416845989387]
["SSB-5G",2.4,8,39,null,39,2.1655489778522115,80.810917596315349,161.6218351926307,692.66500796841729]
["SSB-10GF",22,9,40,null,40,2.1187660907454688,82.595242940870278,165.19048588174056,707.95922520745955]
["(2)SSB-3GF",4.4000000000000004,10,41,null,41,2.0731748258348657,84.411598008637625,168.82319601727525,723.52798293117962]
["(2)SSB-5GF",4.8,11,42,null,42,2.0287406083661188,86.260411645695442,172.52082329139088,739.37495696310373]
["(2)SSB-10GF",44,12,43,null,43,1.9854299820983734,88.142116104766856,176.28423220953371,755.503852326573]
["HY-3E",3.6,13,44,null,44,1.9432105695576491,90.057147043944326,180.11429408788865,771.91840323380848]
["HY-5E",6,14,45,null,45,1.902051033824645,92.005943525137695,184.01188705027533,788.62237307260853]
["(2)HY-3E",7.2,15,46,null,46,1.8619210417929748,93.988948012253076,187.97789602450615,805.61955439074063]
["HY-6E",7.2,16,47,null,47,1.8227912288370163,96.00660636909808,192.01321273819616,822.91376887798356]
["(2)HY-3EF",14.4,17,48,null,48,1.7846331648310461,98.059367857016994,196.11873571403399,840.50886734586004]
["(2)HY-5EF",12,18,49,null,49,1.7474193214640428,100.14768513225521,200.29537026451041,858.40872970504461]
["HY-5G",6,19,50,null,50,1.7111230407968585,102.2720142430574,204.5440284861148,876.61726494049196]
["HY-6G",7.2,20,51,null,51,1.6757185050109931,104.43281462649477,208.86562925298955,895.13841108424094]
["(2)HY-5GF",12,21,52,null,52,1.6411807073002131,106.63054910502802,213.26109821005605,913.97613518595449]
["HY-6SE",19.2,22,53,null,53,1.6074854238585541,108.86568388280367,217.73136776560733,933.13443328117421]
["HY-10SE",19.2,23,54,null,54,1.5746091869202063,111.13868854168457,222.27737708336915,952.6173303572964]
["CNEB/24-24kw",8.4,24,55,null,55,1.5425292588086434,113.45003603702106,226.90007207404213,972.42888031732343]
["CNEB/24-36kw",12.7,null,56,null,56,1.5112236069543985,115.8002026931549,231.6004053863098,992.57316594132772]
["CNEB/24-48kw",16.899999999999999,null,57,null,{"$f":"F27+1","v":57},1.4806708798423893,118.18966819866678,236.37933639733356,1013.0542988457153]
["CNGB/24",13.25,null,58,null,{"$f":"F28+1","v":58},1.4508503838516282,120.61891560135979,241.23783120271958,1033.8764194402268]
["HY-6SG",19.2,null,59,null,59,1.4217420609515063,123.08843130298936,246.17686260597873,1055.043696882766]
{"$rows_left_out":57}
{"sheet":"RO Water Calculator","index":1,"n_rows":6,"n_cols":5,"rows_kept":6,"cut":false,"hidden":false,"merged":[[0,0,0,1],[5,0,11,1]]}
["RO WATER CALCULATOR"]
["Groen Model Number","(2)HY-5EF",{"$f":"VLOOKUP(B2,Sheet3!A:B,2,FALSE)","v":12},{"$f":"+C2*B3","v":168}]
["Operating Hours Per Day",14,"OP175","OP350","BWS1500"]
["Incoming Water Temperature",51,{"$f":"VLOOKUP($B4,Sheet3!$F:$J,3,FALSE)","v":104.43281462649477},{"$f":"VLOOKUP($B4,Sheet3!$F:$J,4,FALSE)","v":208.86562925298955},{"$f":"VLOOKUP($B4,Sheet3!$F:$J,5,FALSE)","v":895.13841108424094}]
["Recommended RO System",{"$f":"IF(D2<=C4,C3,IF(D2<=D4,D3,E3))","v":"OP350"}]
["Click on the cells above using the drop down boxes to choose your data. After data is entered, the suggested RO system will show in the bottom right cell."]

{"sheet":"Sheet1","index":2,"n_rows":94,"n_cols":42,"rows_kept":94,"cut":false,"hidden":true,"merged":[[8,4,9,4],[4,4,4,20],[5,4,5,20],[7,2,7,20],[8,13,8,18],[6,4,6,28],[2,38,6,41],[8,38,8,39],[8,40,9,40],[8,41,9,41],[8,34,9,34],[8,32,8,33],[8,35,9,35],[2,32,6,35],[8,6,8,11],[2,2,2,28],[3,2,3,3],[4,2,4,3],[8,3,9,3],[5,2,5,3],[3,21,3,23],[4,21,4,23],[5,21,5,23],[3,4,3,20],[8,2,9,2],[6,2,6,3],[8,20,8,28]]}
[]
[]
[null,null,"RO \"WATER TEMPERATURE COMPENSATION\" CALCULATOR",null,null,null,null,null,null,null,null,null,null,null,null,null,null,null,null,null,null,null,null,null,null,null,null,null,null,null,null,null,"Effect Temperature has \non System Recovery \nif Permeate Flow \nVaries and Recovery \nRemains Fixed. \n\nAdjust Temperature (Step 3) \nto 77° F (25° C)",null,null,null,null,null,"Effect Temperature has \non System Recovery \nif Permeate Flow \nVaries and Recovery \nRemains Fixed. \n\nAdjust Temperature (Step 3) \nto 50° F (10° C)"]
[null,null,"Step 1",null,"Insert RO system production in the BLUE shaded field.",null,null,null,null,null,null,null,null,null,null,null,null,null,null,null,null,1500]
[null,null,"Step 2",null,"Insert system Recovery in the GREEN shaded field.\nUse 33% for un-softened water\nUse 50% for softened water",null,null,null,null,null,null,null,null,null,null,null,null,null,null,null,null,0.5]
[null,null,"Step 3",null,"Insert water temperature (in °F) in the PURPLE shaded field.",null,null,null,null,null,null,null,null,null,null,null,null,null,null,null,null,46]
[null,null,"Step 4",null,"View your results in the tables below. \nYELLOW shaded areas indicate temperature selected and correction factor - Follow that same row across to locate PERMEATE FLOW, CONCENTRATE FLOW & TOTAL SYSTEM INLET FLOW in RED text."]
[null,null,"CONCENTRATE to PERMEATE RATIO.",null,null,null,null,null,null,null,null,null,null,null,null,null,null,null,null,null,null,{"$f":"IF(V5=0,0,(1-V5)/V5)","v":1}]
[null,null,"Fahrenheit","Celsius","Temperature\nCorrection\n Factor",null,"PERMEATE FLOW",null,null,null,null,null,null,"CONCENTRATE FLOW",null,null,null,null,null,null,"TOTAL SYSTEM INLET FLOW",null,null,null,null,null,null,null,null,null,null,null,"Gallons \nPer Day",null,"Recovery","Percent\nChange",null,null,"Gallons \nPer Day",null,"Recovery","Percent\nChange"]
[null,null,null,null,null,null,"Gallons \nPer Day","Gallons \nPer Hour","Gallons \nPer Minute","Ounces \nPer Minute","Liters \nPer Minute","Milliliters \nPer Minute",null,"Gallons \nPer Day","Gallons \nPer Hour","Gallons \nPer Minute","Ounces \nPer Minute","Liters \nPer Minute","Milliliters \nPer Minute",null,"Gallons \nPer Day","Gallons \nPer Hour","Gallons \nPer Minute","Ounces \nPer Minute","Liters \nPer Minute","Milliliters \nPer Minute",null,null,null,null,null,null,"Permeate\nFlow","Conc.\nFlow",null,null,null,null,"Permeate\nFlow","Conc.\nFlow"]
[null,null,32,{"$f":"(C11-32)*5/9","v":0},{"$f":"EXP(3020*(1/(273+D11)-(1/298)))","v":2.5295536755521004},null,{"$f":"V$4/$E11","v":592.98998653294439},{"$f":"G11/24","v":24.707916105539351},{"$f":"G11/1440","v":0.41179860175898914},{"$f":"I11*128","v":52.710221025150609},{"$f":"I11*3.785","v":1.5586577076577739},{"$f":"I11*3785","v":1558.6577076577739},null,{"$f":"IF(OR($V$4=0,$V$5=0),0,(G11/$V$5)-G11)","v":592.98998653294439},{"$f":"IF(OR($V$4=0,$V$5=0),0,(H11/$V$5)-H11)","v":24.707916105539351},{"$f":"IF(OR($V$4=0,$V$5=0),0,(I11/$V$5)-I11)","v":0.41179860175898914},{"$f":"IF(OR($V$4=0,$V$5=0),0,(J11/$V$5)-J11)","v":52.710221025150609},{"$f":"IF(OR($V$4=0,$V$5=0),0,(K11/$V$5)-K11)","v":1.5586577076577739},{"$f":"IF(OR($V$4=0,$V$5=0),0,(L11/$V$5)-L11)","v":1558.6577076577739},null,{"$f":"IF($V$5=0,0,G11+N11)","v":1185.9799730658888},{"$f":"IF($V$5=0,0,H11+O11)","v":49.415832211078701},{"$f":"IF($V$5=0,0,I11+P11)","v":0.82359720351797827},{"$f":"IF($V$5=0,0,J11+Q11)","v":105.42044205030122},{"$f":"IF($V$5=0,0,K11+R11)","v":3.1173154153155478},{"$f":"IF($V$5=0,0,L11+S11)","v":3117.3154153155479},null,null,null,null,null,null,{"$f":"IF(V$6=C$56,G11,\"\")","v":""},{"$f":"IF(V$6=C$56,N$56,\"\")","v":""},{"$f":"IF(V$6=C$56,G11/(G11+N$56),\"\")","v":""},{"$f":"IF(V$6=77,AI11-AI$56,\"\")","v":""},null,null,{"$f":"IF(V$6=C$29,G11,\"\")","v":""},{"$f":"IF(V$6=C$29,N$29,\"\")","v":""},{"$f":"IF(V$6=C$29,G11/(G11+N$56),\"\")","v":""},{"$f":"IF(V$6=50,AO11-AO$29,\"\")","v":""}]
[null,null,{"$f":"C11+1","v":33},{"$f":"(C12-32)*5/9","v":0.55555555555555558},{"$f":"EXP(3020*(1/(273+D12)-(1/298)))","v":2.4733582649681667},null,606.46288944287085,{"$f":"G12/24","v":25.26928706011962},{"$f":"G12/1440","v":0.42115478433532699},{"$f":"I12*128","v":53.907812394921855},{"$f":"I12*3.785","v":1.5940708587092127},{"$f":"I12*3785","v":1594.0708587092126},null,606.46288944287085,25.26928706011962,0.42115478433532699,53.907812394921855,1.5940708587092127,1594.0708587092126,null,1212.9257788857417,50.53857412023924,0.84230956867065399,107.81562478984371,3.1881417174184254,3188.1417174184253,null,null,null,null,null,null,"","","","",null,null,"","","",""]
[null,null,{"$f":"C12+1","v":34},1.1111111111111112,2.418631511487106,null,620.18542009225644,25.841059170510686,0.43068431950851144,55.127592897089464,1.6301401493397158,1630.1401493397159,null,620.18542009225644,25.841059170510686,0.43068431950851144,55.127592897089464,1.6301401493397158,1630.1401493397159,null,1240.3708401845129,51.682118341021372,0.86136863901702287,110.25518579417893,3.2602802986794317,3260.2802986794318,null,null,null,null,null,null,"","","","",null,null,"","","",""]
[null,null,35,1.6666666666666667,2.3653297541357068,null,634.16104979751594,26.423377074896496,0.44038961791494163,56.369871093112529,1.6668747038080542,1666.8747038080542,null,634.16104979751594,26.423377074896496,0.44038961791494163,56.369871093112529,1.6668747038080542,1666.8747038080542,null,1268.3220995950319,52.846754149792993,0.88077923582988327,112.73974218622506,3.3337494076161085,3333.7494076161083,null,null,null,null,null,null,"","","","",null,null,"","","",""]
[null,null,36,2.2222222222222223,2.3134107776623911,null,648.39327908539008,27.016386628557921,0.45027311047596535,57.634958140923565,1.7042837231515289,1704.2837231515289,null,648.39327908539008,27.016386628557921,0.45027311047596535,57.634958140923565,1.7042837231515289,1704.2837231515289,null,1296.7865581707802,54.032773257115842,0.90054622095193071,115.26991628184713,3.4085674463030577,3408.5674463030577,null,null,null,null,null,null,"","","","",null,null,"","","",""]
[null,null,37,2.7777777777777777,2.2628337599947863,null,662.88563769857137,{"$f":"G16/24","v":27.620234904107139},0.46033724840178569,58.923167795428569,1.7423764852007588,1742.3764852007589,null,662.88563769857137,27.620234904107139,0.46033724840178569,58.923167795428569,1.7423764852007588,1742.3764852007589,null,1325.7712753971427,55.240469808214279,0.92067449680357138,117.84633559085714,3.4847529704015177,3484.7529704015178,null,null,null,null,null,null,"","","","",null,null,"","","",""]
[null,null,38,3.3333333333333335,2.2135592217703857,null,677.6416845989387,28.235070191622444,0.47058450319370743,60.234816408794551,1.7811623445881826,1781.1623445881826,null,677.6416845989387,28.235070191622444,0.47058450319370743,60.234816408794551,1.7811623445881826,1781.1623445881826,null,1355.2833691978774,56.470140383244889,0.94116900638741485,120.4696328175891,3.5623246891763651,3562.3246891763652,null,null,null,null,null,null,"","","","",null,null,"","",{"$f":"IF(V$6=C$29,G17/(G17+N$29),\"\")","v":""},""]
[null,null,39,3.8888888888888888,2.1655489778522115,null,692.66500796841729,28.861041998684055,0.48101736664473421,61.570222930525979,1.820650732750319,1820.6507327503191,null,692.66500796841729,28.861041998684055,0.48101736664473421,61.570222930525979,1.820650732750319,1820.6507327503191,null,1385.3300159368346,57.722083997368109,0.96203473328946842,123.14044586105196,3.6413014655006379,3641.3014655006382,null,null,null,null,null,null,"","","","",null,null,"","","",""]
[null,null,40,4.4444444444444446,2.1187660907454688,null,707.95922520745955,29.498301050310815,0.49163835083851359,62.92970890732974,1.8608511579237741,1860.8511579237741,null,707.95922520745955,29.498301050310815,0.49163835083851359,62.92970890732974,1.8608511579237741,1860.8511579237741,null,1415.9184504149191,58.996602100621629,0.98327670167702719,125.85941781465948,3.7217023158475482,3721.7023158475481,null,null,null,null,null,null,"","","","",null,null,"","","",""]
[null,null,41,5,2.0731748258348657,null,723.52798293117962,30.146999288799151,0.50244998814665254,64.313598482771525,1.90177320513508,1901.7732051350799,null,723.52798293117962,30.146999288799151,0.50244998814665254,64.313598482771525,1.90177320513508,1901.7732051350799,null,1447.0559658623592,60.293998577598302,1.0048999762933051,128.62719696554305,3.8035464102701599,3803.5464102701599,null,null,null,null,null,null,"","","","",null,null,"","","",""]
[null,null,42,5.5555555555555554,2.0287406083661188,null,739.37495696310373,30.807289873462654,0.51345483122437763,65.722218396720336,1.9434265361842693,1943.4265361842693,null,739.37495696310373,30.807289873462654,0.51345483122437763,65.722218396720336,1.9434265361842693,1943.4265361842693,null,1478.7499139262075,61.614579746925308,1.0269096624487553,131.44443679344067,3.8868530723685386,3886.8530723685385,null,null,null,null,null,null,"","","","",null,null,"","","",""]
[null,null,43,6.1111111111111107,1.9854299820983734,null,755.503852326573,31.479327180273874,0.52465545300456462,67.155897984584271,1.9858208896222771,1985.820889622277,null,755.503852326573,31.479327180273874,0.52465545300456462,67.155897984584271,1.9858208896222771,1985.820889622277,null,1511.007704653146,62.958654360547747,1.0493109060091292,134.31179596916854,3.9716417792445542,3971.6417792445541,null,null,null,null,null,null,"","","","",null,null,"","","",""]
[null,null,44,6.666666666666667,1.9432105695576491,null,771.91840323380848,32.163266801408689,0.53605444669014479,68.614969176338533,2.0289660807221983,2028.9660807221981,null,771.91840323380848,32.163266801408689,0.53605444669014479,68.614969176338533,2.0289660807221983,2028.9660807221981,null,1543.836806467617,64.326533602817378,1.0721088933802896,137.22993835267707,4.0579321614443966,4057.9321614443961,null,null,null,null,null,null,"","","","",null,null,"","","",""]
[null,null,45,7.2222222222222223,1.902051033824645,null,788.62237307260853,32.859265544692022,0.547654425744867,70.099766495342976,2.0728720014443218,2072.8720014443215,null,788.62237307260853,32.859265544692022,0.547654425744867,70.099766495342976,2.0728720014443218,2072.8720014443215,null,1577.2447461452171,65.718531089384044,1.095308851489734,140.19953299068595,4.1457440028886436,4145.7440028886431,null,null,null,null,null,null,"","","","",null,null,"","","",""]
[null,null,46,7.7777777777777777,1.8619210417929748,null,805.61955439074063,33.567481432947524,0.5594580238824588,71.610627056954726,2.1175486203951066,2117.5486203951064,null,805.61955439074063,33.567481432947524,0.5594580238824588,71.610627056954726,2.1175486203951066,2117.5486203951064,null,1611.2391087814813,67.134962865895048,1.1189160477649176,143.22125411390945,4.2350972407902132,4235.0972407902127,null,null,null,null,null,null,"","","","",null,null,"","","",""]
[null,null,47,8.3333333333333339,1.8227912288370163,null,822.91376887798356,34.288073703249317,0.57146789505415529,73.147890566931878,2.1630059827799779,2163.0059827799778,null,822.91376887798356,34.288073703249317,0.57146789505415529,73.147890566931878,2.1630059827799779,2163.0059827799778,null,1645.8275377559671,68.576147406498634,1.1429357901083106,146.29578113386376,4.3260119655599558,4326.0119655599556,null,null,null,null,null,null,"","","","",null,null,"","","",""]
[null,null,48,8.8888888888888893,1.7846331648310461,null,840.50886734586004,35.021202806077504,0.58368671343462508,74.71189931963201,2.2092542103500561,2209.2542103500559,null,840.50886734586004,35.021202806077504,0.58368671343462508,74.71189931963201,2.2092542103500561,2209.2542103500559,null,1681.0177346917201,70.042405612155008,1.1673734268692502,149.42379863926402,4.4185084207001122,4418.5084207001119,null,null,null,null,null,null,"","","","",null,null,"","","",""]
[null,null,49,9.4444444444444446,1.7474193214640428,null,858.40872970504461,35.767030404376861,0.59611717340628101,76.302998196003969,2.2563035013427739,2256.3035013427734,null,858.40872970504461,35.767030404376861,0.59611717340628101,76.302998196003969,2.2563035013427739,2256.3035013427734,null,1716.8174594100892,71.534060808753722,1.192234346812562,152.60599639200794,4.5126070026855478,4512.6070026855468,null,null,null,null,null,null,"","","","",null,null,"","","",""]
[null,null,50,10,1.7111230407968585,null,876.61726494049196,36.525719372520498,0.60876198954200833,77.921534661377066,2.3041641304165017,2304.1641304165014,null,876.61726494049196,36.525719372520498,0.60876198954200833,77.921534661377066,2.3041641304165017,2304.1641304165014,null,1753.2345298809839,73.051438745040997,1.2175239790840167,155.84306932275413,4.6083282608330034,4608.3282608330028,null,null,null,null,null,null,"","","","",null,null,"","","",""]
[null,null,51,10.555555555555555,1.6757185050109931,null,895.13841108424094,37.297433795176708,0.62162389658627848,79.567858763043645,2.3528464485790641,2352.8464485790641,null,895.13841108424094,37.297433795176708,0.62162389658627848,79.567858763043645,2.3528464485790641,2352.8464485790641,null,1790.2768221684819,74.594867590353417,1.243247793172557,159.13571752608729,4.7056928971581282,4705.6928971581283,null,null,null,null,null,null,"","","","",null,null,"","","",""]
{"$rows_left_out":65}
{"sheet":"Sheet2","index":3,"n_rows":865,"n_cols":17,"rows_kept":865,"cut":false,"hidden":true,"merged":[]}
["Enter Groen model number with drop down box - v look up","Hourly water usage","How many hours per day with drop down box","Is water softened or not.  Drop down box",null,"F or C","Temperature",null,null,null,null,null,"Model #","Operational Hours Per Day","Water\nSoftener","F or C","Water\nTemp"]
["Enter all steamer models",null,null,null,null,null,null,null,{"$f":"'RO Water Calculator'!B2","v":"(2)HY-5EF"},175,"OP175",null,"SSB-3E",1,"Yes","F",0]
["SSB-3E",5.3,1,"Yes",0.5,"F",0,null,{"$f":"'RO Water Calculator'!B3","v":14},350,"OP350",null,"SSB-3E",2,"Yes","F",0]
["SSB-5E",6.9,2,"No",0.33,"C",1,null,{"$f":"'RO Water Calculator'!#REF!","v":{"$error":"#REF!"}},1500,"BWS1500",null,"SSB-3E",3,"Yes","F",0]
["SSB-10EF",22,3,null,null,null,2,null,{"$f":"'RO Water Calculator'!#REF!","v":{"$error":"#REF!"}},null,null,null,"SSB-3E",4,"Yes","F",0]
["(2)SSB-3EF",10.6,4,null,null,null,3,null,{"$f":"'RO Water Calculator'!B4","v":51},null,null,null,"SSB-3E",5,"Yes","F",0]
["(2)SSB-5EF",13.8,5,null,null,null,4,null,{"$f":"I2&I3&I4&I5&I6","v":{"$error":"#REF!"}},null,null,null,"SSB-3E",6,"Yes","F",0]
["(2)SSB-10EF",44,6,null,null,null,5,null,null,null,null,null,"SSB-3E",7,"Yes","F",0]
["SSB-3G",2.2000000000000002,7,null,null,null,6,null,32,null,null,null,"SSB-3E",8,"Yes","F",0]
["SSB-5G",2.4,8,null,null,null,7,null,33,null,null,null,"SSB-3E",9,"Yes","F",0]
["SSB-10GF",22,9,null,null,null,8,null,34,null,null,null,"SSB-3E",10,"Yes","F",0]
["(2)SSB-3GF",4.4000000000000004,10,null,null,null,9,null,35,null,null,null,"SSB-3E",11,"Yes","F",0]
["(2)SSB-5GF",4.8,11,null,null,null,10,null,36,null,null,null,"SSB-3E",12,"Yes","F",0]
["(2)SSB-10GF",44,12,null,null,null,11,null,37,null,null,null,"SSB-3E",13,"Yes","F",0]
["HY-3E",3.6,13,null,null,null,12,null,38,null,null,null,"SSB-3E",14,"Yes","F",0]
["HY-5E",6,14,null,null,null,13,null,39,null,null,null,"SSB-3E",15,"Yes","F",0]
["(2)HY-3E",7.2,15,null,null,null,14,null,40,null,null,null,"SSB-3E",16,"Yes","F",0]
["HY-6E",7.2,16,null,null,null,15,null,41,null,null,null,"SSB-3E",17,"Yes","F",0]
["(2)HY-3EF",14.4,17,null,null,null,16,null,42,null,null,null,"SSB-3E",18,"Yes","F",0]
["(2)HY-5EF",12,18,null,null,null,17,null,43,null,null,null,"SSB-3E",19,"Yes","F",0]
["HY-5G",6,19,null,null,null,18,null,44,null,null,null,"SSB-3E",20,"Yes","F",0]
["HY-6G",7.2,20,null,null,null,19,null,45,null,null,null,"SSB-3E",21,"Yes","F",0]
["(2)HY-5GF",12,21,null,null,null,20,null,46,null,null,null,"SSB-3E",22,"Yes","F",0]
["HY-6SE",19.2,22,null,null,null,21,null,47,null,null,null,"SSB-3E",23,"Yes","F",0]
["HY-10SE",19.2,23,null,null,null,22,null,48,null,null,null,"SSB-3E",24,"Yes","F",0]
["CNEB/24-24kw",8.4,24,null,null,null,23,null,49,null,null,null,"SSB-3E",1,"No","F",0]
["CNEB/24-36kw",12.7,null,null,null,null,24,null,50,null,null,null,"SSB-3E",2,"No","F",0]
["CNEB/24-48kw",16.899999999999999,null,null,null,null,25,null,51,null,null,null,"SSB-3E",3,"No","F",0]
["CNGB/24",13.25,null,null,null,null,26,null,52,null,null,null,"SSB-3E",4,"No","F",0]
["HY-6SG",19.2,null,null,null,null,27,null,53,null,null,null,"SSB-3E",5,"No","F",0]
{"$rows_left_out":835}